SEMrush

Please wait for loading...

SEMrush

traceback most recent call las





keyword competition rating: 2.0 / 5.0

SEMrush
/
 1  +100 python.org
8. Errors and Exceptions — Python 2.7.8 documentationZeroDivisionError: integer division or modulo by zero >>> 4 + spam*3 Traceback ( most recent call last ): File "<stdin>", line 1, in ? NameError: name 'spam' is not ...
 3  +1 stackoverflow.com
Python Cmd/Powershell error " Traceback ( Most recent call last In this case, from my understanding, you have no modules called "MAXREPEAT" or you(or the installer) have installed it somewhere wrong.
 4  +40 appcelerator.com
Error: Traceback ( most recent call last ) - Developers - Appceleratorhello,. i need your help i get this error: [ERROR] [ERROR] Error: Traceback ( most recent call last ): File "/Users/ElizaS/Library/Application ...
 5  +95 pymotw.com
traceback - Python Module of the WeekThe traceback module works with the call stack to produce error messages. .... python traceback_print_exception.py Traceback ( most recent call last ): File ...
 7  +94 udacity.com
Error: Traceback ( most recent call last ) - Udacity ForumsI got this error: : public static void main(String[] args) { Scanner in = new ...
 8  +92 odoo.com
How to understand Traceback ( most recent call last )? | Odoo - OpenERPMost people who start with OpenERP doesn't make the right set-up of the
 9  -4 stackexchange.com
bash - Why is this python error message generated whenever I type Any idea how to debug this? $ somenonexistingcommand Traceback ( most recent call last ): File "/usr/local/lib/python2.7/site.py", line 553, ...
 10  +23 ros.org
Roslaunch Traceback ( most recent call last ) - ROS Answers: Open youbot@youbot-laptop:~$ roslaunch Traceback ( most recent call last ): File "/opt/ ros/diamondback/ros/bin/roslaunch", line 2, in <module> from ...
 11  +35 blenderartists.org
Blender 2.69 Runtime error - Traceback , most recent call last Hi guys, I enabled the addon of "Save game as runtime". And when I´m going to export, I get a traceback ( most recent call last ) error
 12  +89 bytes.com
Traceback ( most recent call last ): PROBLEM - Python - BytesNeed help? Post your question and get tips & solutions from a ... Hello everyone, I keep obtaining an error message whenever I execute some
 13  +15 github.com
youtube-dl 2014.07.11.3 ERROR: Automatic signature extraction prestonconnors changed the title from youtube-dl 2014.07.11.3 ERROR: Automatic signature extraction failed: Traceback ( most recent call last ) ...
 14  +39 wikipedia.org
Stack trace - Wikipedia, the free encyclopediaIn computing, a stack trace (also called stack backtrace or stack traceback) is a ... Traceback ( most recent call last ): File "tb.py", line 10, in <module> a() File ...
 15  +86 couchpota.to
CouchPotato - Forums • View topic - Strange error03-27 18:51:05 ERROR [ couchpotato.core.event] Error in event "scanner. name_year", that wasn't caught: Traceback ( most recent call last ):
 16  +85 lbl.gov
Error messages from all log files - CCITraceback ( most recent call last ): SyntaxError: invalid syntax ERROR show_number_of_processors.py Traceback ( most recent call last ): AssertionError  ...
 17  +84 askubuntu.com
12.04 - No module named setuptools/ setuptools is already the And when I run it again, I get the exact same traceback- ... sudo python setup.py install Traceback ( most recent call last ): File "setup.py", line 21, ...
 18  +83 pythonhosted.org
Errors and remote tracebacks — Pyro 4.27 documentationPyro fixes this because it stores the traceback information on a special attribute on the ... Traceback ( most recent call last ): File "client.py", line 50, in <module> ...
 19  +81 ipython.org
16_ExceptionsDebugging.ipynb - NBViewer - IPythonTypeError Traceback ( most recent call last ) <ipython-input-4-785fcfd7f367> in < module>() ----> 1 x = 1 + 'abc' TypeError: unsupported operand type(s) for +: 'int' ...
 20  +81 nyu.edu
lect9.clean'abc', 3] >>> x * x Traceback ( most recent call last ): File "<stdin>", line 1, in < module> TypeError: can't multiply sequence by non-int of type 'list' >>> y = (1,2,3)  ...
 21  +80 flexget.com
PitFalls – FlexGetTraceback ( most recent call last ): File "/usr/lib/python2.6/_MozillaCookieJar.py", line 82, in _really_load assert domain_specified == initial_dot ...
 22  +51 readthedocs.org
When Plugins Fail — nose 1.3.4 documentationBut with the fail-after plugin, the entire test run will fail. >>> run(argv=['nosetests', suitepath], ... plugins=[FailAfterPlugin()]) Traceback ( most recent call last ): .
 23  +77 twitter.com
Chris McDonough on Twitter: ">>> import life_of_leisure Traceback import life_of_leisure Traceback ( most recent call last ): File "<stdin>", line 1 ImportError: No module named life_of_leisure >>>. Reply; Retweet ...
 24  +76 univ-evry.fr
Module `snakes.hashables` - Franck Pommereaul = hlist(range(5)) >>> l hlist([0, 1, 2, 3, 4]) >>> _ = hash(l) >>> l.append(5) Traceback ( most recent call last ): ... ValueError: hashed 'hlist' object is not mutable ...
 25  +76 redhat.com
Bug 622179 – failed to install signature: Traceback ( most recent call First update of 22 packages: failed to install signature: Traceback ( most recent call last ): File "/usr/share/PackageKit/helpers/yum/yumBackend.py", line 2926, ...
 26  +75 ycombinator.com
Oops: &#62; import subprocess Traceback ( most recent call last ): FileOops: > import subprocess Traceback ( most recent call last ): File "<stdin>", line 1, in <module> File "/lib/python2.7/subprocess.py", line 429, in <module> import ...
 27  +73 diveintopython3.net
Your first Python program - Dive Into Python 3These are function calls — first calling the approximate_size() function and passing a ..... x Traceback ( most recent call last ): File "<stdin>", line 1, in <module > ...
 28  -16 launchpad.net
Bug #1294877 “Error erasing device: Unknown or unsupported It will popup an exception window with the error message similar to: Traceback ( most recent call last ): File "format.py", line 7, in.
 29  +71 freecadweb.org
FreeCAD forum • View topic - Crash on angular dimensions toolTraceback ( most recent call last ): File "/home/jo/Logiciels/FreeCAD/free-cad-code /build/Mod/Draft/Draft.py", line 3465, in attach self.
 30  -16 sourceforge.net
PyMOL Molecular Graphics System / Mailing Lists - SourceForgeTraceback ( most recent call last ): File "C:\Program Files\DeLano Scientific\ PyMOL/modules\pmg_tk\PMGApp.py", line 222, in initializePlugins __builtin__.
 31  +23 archlinux.org
[SOLVED] wxpython update cause problems for playonlinux (Page 1 3.3.3 - skipped Looking for python2.7... 2.7.6 - selected Traceback ( most recent call last ): File "mainwindow.py", line 34, ...
 32  +69 sthurlow.com
Lesson 11 - Exception Handling - steven thurlowThe most common problems with your code are of your own doing. Sad ... Traceback ( most recent call last ): File "/home/steven/errortest.py", line 8, in - toplevel- ...
 33  +67 python-kurs.eu
Python-Kurs: Ausnahmebehandlungn = int(raw_input("Please enter a number: ")) Please enter a number: 23.5 Traceback ( most recent call last ): File "<stdin>", line 1, in <module> ValueError: invalid ...
 34  +17 gentoo.org
Gentoo Forums :: View topic - No module named 'portage' from Traceback ( most recent call last ): File "<string>", line 7, in <module> ImportError: No module named 'portage' * Starting Python Updater.
 35  +66 oracle.com
Issue with FDMEE integration to HFM | Oracle Community - Oracle Traceback ( most recent call last ): File "<string>", line 4380, in exportData. File "< string>", line 558, in executeVBScript. RuntimeError: -5.
 36  ~ laconsigna.wordpress.comFixing textext on Inkscape 0.48 | La ConsignaTraceback ( most recent call last ): File "textext.py", line 306, in <module>. raise RuntimeError("Neither pygtk nor Tkinter is available!").
 37  +33 bitcointalk.org
GUIMiner-scrypt: A GUIMiner fork for mining scrypt chains Traceback ( most recent call last ): File "guiminer.py", line 2845, in run. File " guiminer.py", line 2130, in __init__. File "json\__init__.pyo", line 278, ...
 38  -31 google.com
Issue 190 - google-apps-manager - gam 3.02 failed with Traceback ( most recent call last ): File "gam.py", line 5857, in <module> doGetDomainInfo() File "gam.py", line 4151, in doGetDomainInfo adm ...
 39  +61 parse.com
Parse deploy fails - Python error | ParseUploading source files Traceback ( most recent call last ): File "/System/Library/ Frameworks/Python.framework/Versions/2.7/lib/python2.7/runpy.py", line 162, ...
 41  +60 sabnzbd.org
SABnzbd Forums • View topic - CherryPy Timeout Error2014-03-27 22:16:29,590 ERROR: [27/Mar/2014:22:16:29] Traceback ( most recent call last ): File "/usr/share/sabnzbdplus/cherrypy/_cpwsgi.py" ...
 42  +59 minecraftforum.net
[TOOLKIT] Mod Coder Pack (MCP) - Minecraft Tools - Mapping and If you really want to clean up, enter "Yes" yes == MCP 5.6 (data: 5.6, client: 1.1, server: 1.1) == Traceback ( most recent call last ): File "runtime\cleanup.py", line 87  ...
 43  +57 digitalocean.com
How To Install and Set Up OpenERP 7.0 on a Debian 7/Ubuntu OpenERP is probably the most well-known open-source ERP solution ... OpenERP Server Error Client Traceback ( most recent call last ): File ...
 44  +57 zope.org
Fields — zope.schema 4.2 documentationfromUnicode(u(" foo x.y.z bat")) ' foo x.y.z bat' >>> obj.fromUnicode(u(" foo y.z bat" )) Traceback ( most recent call last ): ... ConstraintNotSatisfied: foo y.z bat ...
 45  +55 ankiweb.net
Media Import - Anki - friendly, intelligent flashcardsTraceback ( most recent call last ): File "C:\Users\manuel\Documents\Anki\addons\ Media_Import.py", line 65, in doMediaImport note['Front'] = ...
 46  +54 bu.edu
Intro Python DebuggingThe last common type of syntax error you will likely encounter has to do with indention. You may see unindent does not ... Traceback ( most recent call last ): File ...
 47  -8 microsoft.com
Windows Vista Error - Microsoft CommunityTrying to troubleshoot for a relative remotely. She receives an error message referring to this log: Traceback ( most recent call last ): File ...
 48  ~ communitycrops.orgCommunity CropsTraceback ( most recent call last ): File "index.cgi", line 724, in markup text = getattr (this_module, 'markup_'+command)(text, meta, **thing_context) AttributeError: ...
 49  +51 jennic.com
FlashGUI.exe_2.log - Jennic__del__ of <CommDeviceWin32.cCommDeviceOL instance at 0x023D0E68>> ignored Traceback ( most recent call last ): File "FlashProgrammer.pyw", line 1155  ...
 50  +50 vmware.com
VMware KB: Remediating an ESXi 5.x host fails with the error: The ... esxupdate: ERROR: An esxupdate error exception was caught: T09:35:10Z esxupdate: esxupdate: ERROR: Traceback ( most recent call last ):
 51  +49 cineversity.com
X-Particles particle system successfully loaded X-Particles v2 ART_AUTOCLOSE]: AttributeError: 'module' object has no attribute ' ART_AUTOCLOSE' Traceback ( most recent call last ): File "'CV-ArtSmartObject. pyp'", line ...
 52  +49 inkscapeforum.com
InkscapeForum.com • View topic - [solved] textext 0.4.4 on win7 Traceback ( most recent call last ): File "textext.py", line 306, in <module> raise RuntimeError("Neither pygtk nor Tkinter is available!")